Concorrência imperfeita
type: Concept
type: NamedIndividual
narrower: Oligopólio

Microtesauro de Defesa Econômica
type: ConceptGroup
type: NamedIndividual

Duopólio
type: Concept
type: NamedIndividual
broader: Oligopólio

Oligopólio
type: NamedIndividual
type: Concept
definition source: [REF] Elaborada a partir de ESCOLA NACIONAL DE ADMINISTRAÇÃO PÚBLICA (ENAP). Introdução à defesa da concorrência. Brasília: ENAP, 2021. Acesso em: 23 de jan. 2024. @pt-br
creator: Projeto Cade: Frente de ontologia @pt-br
dateAccepted: 06/03/2024 @pt-br
dateSubmitted: 06/02/2024 @pt-br
modified: 11/04/2026 00:45:14 @pt-br
memberOf: Microtesauro de Defesa Econômica
creation date: 2022-11-10T21:31:01.487327Z @pt-br
alternative label: Oligopoly
broader: Concorrência imperfeita
definition: Oligopólio é uma estrutura de mercado caracterizada pela presença de barreiras à entrada, na qual a produção e a oferta de determinado produto — homogêneo ou diferenciado — são feitas por poucas empresas. @pt-br
editorial note: 1. Definição anterior, alterada em 16/02/2024, conforme sugestão de especialistas: Oligopólio é uma estrutura de mercado caracterizada pela presença de algum tipo de barreira à entrada, na qual a produção e a oferta de determinado bem ou serviço — homogêneo ou diferenciado — são feitas por três ou mais empresas. ------------------- 2. Informações coletadas para análise: [DEF1] Mercado com poucas empresas (maiores firmas são dominantes), com certa interdependência de suas decisões. Fonte: ENAP (2021, p.6). [DEF2] Um oligopólio é um mercado caracterizado por altas barreiras à entrada e um pequeno número de firmas que ofertam produtos homogêneos ou diferenciados - um exemplo é a indústria automobilística, composta por poucas firmas e com altos custos à entrada. A lucratividade das empresas oligopolistas dependera das interações estratégicas realizadas entre as mesmas: se agirem competitivamente, o resultado final será próximo ao de um mercado perfeitamente competitivo. Se resolverem cooperar entre si, poderão combinar preços e quantidades de modo a obter maiores lucros, aproximando o resultado ao de um monopólio. Fonte: OLIVEIRA, Gesner; RODAS, João Grandino. Direito e economia da concorrência. 2. ed rev. e atual. São Paulo: Editora Revista dos Tribunais, 2013. (Biblioteca de Direito e Economia, v. 3). Acesso em: 25 de jan. 2023. {p.168} [DEF3] Tipo de estrutura de mercado, nas economias capitalistas, em que poucas empresas detêm o controle da maior parcela do mercado. O oligopólio é uma tendência que reflete a concentração da propriedade em poucas empresas de grande porte, pela fusão entre elas, incorporação ou mesmo eliminação (por compra, dumping e outras práticas restritivas) das pequenas empresas. Fonte: SANDRONI, Paulo. Novíssimo Dicionário de Economia. São Paulo: Editora Best Seller, 1999. Acesso em: 25 de jan. 2022. {p.431} ------------------------------------------------------------------------------------------- As pequenas empresas dão, muitas vezes, lugar a… @pt-br
example: O oligopólio ocorre, normalmente, em indústrias como as dos setores automobilísticos, aço, petroquímica, farmacêutica, de telefonia, TV a cabo, eletroeletrônicos e de equipamentos de informática, compostas por poucas firmas e com altos custos à entrada. @pt-br
narrower: Triopólio
narrower: Duopólio
scope note: [NE06] Em um oligopólio, as empresas operam com certa interdependência de suas decisões. [REF] PAN5, m. 1, p. 6, Introdução à Defesa da Concorrência @pt-br
scope note: [NE02] O oligopólio é uma tendência que reflete a concentração da propriedade em poucas empresas de grande porte, pela fusão entre elas, incorporação ou mesmo eliminação (por compra, dumping e outras práticas restritivas) das pequenas empresas. [REF] SANDRONI, Paulo. Novíssimo Dicionário de Economia. São Paulo: Editora Best Seller, 1999. Disponível em: http://www2.fct.unesp.br/docentes/geo/magaldi/GEO_ECONOMICA_2019/dicionario-de-economia-sandroni.pdf. Acesso em: 06 fev. 2024. @pt-br
scope note: [NE01] A lucratividade das empresas oligopolistas dependerá das interações estratégicas realizadas entre as mesmas: se agirem competitivamente, o resultado final será próximo ao de um mercado perfeitamente competitivo. Se resolverem cooperar entre si, poderão combinar preços e quantidades de modo a obter maiores lucros, aproximando o resultado ao de um monopólio. [REF] OLIVEIRA, Gesner; RODAS, João Grandino. Direito e economia da concorrência. 2. ed rev. e atual. São Paulo: Editora Revista dos Tribunais, 2013. (Biblioteca de Direito e Economia, v. 3). @pt-br
scope note: [NE03] As pequenas empresas dão, muitas vezes, lugar a monopólios e oligopólios, mediante processo de integração vertical e horizontal. [REF] FORGIONI, Paula. A. Os fundamentos do antitruste. 10. ed. rev., atual. e ampl. São Paulo: Thomson Reuters Brasil, 2018. 508 p. @pt-br
scope note: [NE05] Na maioria dos modelos de oligopólio, faz parte do processo competitivo normal que a entrada de um competidor provoque uma reação das incumbentes, levando-as a reduzir preços, como cobrir a oferta de um concorrente. [REF] MOTTA, Massimo; SALGADO, Lucia Helena. Política de concorrência: teoria e prática e sua aplicação no Brasil. Rio de Janeiro: Elsevier, 2015. @pt-br
scope note: [NE04] Em um oligopólio, temos mais de dois agentes econômicos atuando no mercado, cujos comportamentos influenciam-se mutuamente, enquanto no caso do monopólio apenas um agente determina as regras do jogo do mercado. [REF] FORGIONI, Paula. A. Os fundamentos do antitruste. 10. ed. rev., atual. e ampl. São Paulo: Thomson Reuters Brasil, 2018. 508 p. @pt-br

Triopólio
type: Concept
type: NamedIndividual
broader: Oligopólio

definition source
label: Fonte da definição @pt-br

creator
label: Criador @pt-br

dateAccepted
comment: Propriedade de anotação a ser utilizada para registro da data de validação de um termo por especialistas de domínio. @pt-br
label: Data de validação @pt-br

dateSubmitted
comment: Propriedade de anotação para registro da data de homologação de um termo. @pt-br
label: Data de homologação @pt-br

modified
label: Data da última modificação @pt-br

memberOf
label: Membro de @pt-br
definition: Identifies a concept collection.

Concept
type: Class

alternative label
comment: The range of skos:altLabel is the class of RDF plain literals.
comment: skos:prefLabel, skos:altLabel and skos:hiddenLabel are pairwise disjoint properties.
label: Termo alternativo @pt-br
sub property of: label
definition: An alternative lexical label for a resource.

has broader
comment: Broader concepts are typically rendered as parents in a concept hierarchy (tree).
sub property of: Transitive
definition: Relates a concept to a concept that is more general in meaning.

definition
sub property of: note
definition: Definição @pt-br
definition: A statement or formal explanation of the meaning of a concept.

editorial note
sub property of: note
definition: A note for an editor, translator or maintainer of the vocabulary.

example
sub property of: note
definition: An example of the use of a concept.

has narrower
comment: Narrower concepts are typically rendered as children in a concept hierarchy (tree).
sub property of: Transitive
definition: Relates a concept to a concept that is more specific in meaning.

preferred label
comment: skos:prefLabel, skos:altLabel and skos:hiddenLabel are pairwise disjoint properties.
comment: The range of skos:prefLabel is the class of RDF plain literals.
comment: A resource has no more than one value of skos:prefLabel per language tag, and no more than one value of skos:prefLabel without language tag.
sub property of: label
definition: The preferred lexical label for a resource, in a given language.

scope note
sub property of: note
definition: A note that helps to clarify the meaning and/or the use of a concept.