scope note
sub property of: note
definition: A note that helps to clarify the meaning and/or the use of a concept.

Microtesauro de Defesa Econômica
type: ConceptGroup
type: NamedIndividual

Concept
type: Class

modified
label: Data da última modificação @pt-br

memberOf
definition: Identifies a concept collection.
label: Membro de @pt-br

definition source
label: Fonte da definição @pt-br

definition
sub property of: note
definition: Definição @pt-br
definition: A statement or formal explanation of the meaning of a concept.

editorial note
sub property of: note
definition: A note for an editor, translator or maintainer of the vocabulary.

creator
label: Criador @pt-br

Poder de mercado na compra
type: NamedIndividual
scope note: [NE04] A análise de poder de compra é complexa, dado que, a princípio, o poder de compra resulta em menores preços nos insumos que pode implicar descontos também no preço final praticado aos consumidores. O escrutínio do poder de compra, portanto, deve ser feito com cuidado, para que eventuais efeitos positivos aos consumidores sejam preservados. [REF] CONSELHO ADMINISTRATIVO DE DEFESA ECONÔMICA. Guia para análise de atos de concentração horizontal. Brasília: Cade, 2016. 59 p. @pt-br
scope note: [NE01] O poder de compra de agentes coordenados, além de se manifestar como poder de monopsônio, também pode se manifestar como poder compensatório, na medida em que serve para barganhar vantagens, o que não se conseguiria individualmente, face a um poder de mercado pré-existente. [REF] Fonte: https://sei.cade.gov.br/sei//modulos/pesquisa/md_pesq_documento_consulta_externa.php?11fcbFkN81DNKUdhz4iilnqI5_uKxXOK06JWeBzhMdu1o7VqyXeq9tKSSC3I_YlnBX8Qjt099g7spbtEu5Ayy4ESz_KPZvw8GICHFo3h89GniULsChqNQocAPUA9amHF%22 @pt-br
scope note: [NE06] Alguns atos de concentração horizontal envolvem empresas que absorvem parcelas significativas de tipos de insumos que, por sua vez, podem gerar empresas com poder de mercado na compra. O aumento do poder de mercado na compra pode elevar a probabilidade de prejuízos à concorrência decorrente da operação e resultar, inclusive, em poder de monopsônio. Por outro lado, é corrente o argumento que a concentração no mercado de compras pode gerar um poder compensatório que seja benéfico ao consumidor. Avalia-se se a concentração no mercado de compras de insumos: I - gera ou reforça a assimetria de tamanho em relação aos fornecedores; II - e/ou dá condições para as requerentes aumentarem sua influência sobre as condições de mercado. [REF] CONSELHO ADMINISTRATIVO DE DEFESA ECONÔMICA. Guia para análise de atos de concentração horizontal. Brasília: Cade, 2016. 59 p. @pt-br
scope note: [NE05] Em que pese o reconhecimento de benefícios advindos do poder compensatório, ressalta-se que o Guia H, elaborado pelo Cade, admite tal possibilidade apenas em relação ao poder de compra e, de acordo com a jurisprudência pátria, considera-se tão somente a presença de um demandante de grande porte, ou seja, uma estrutura de monopsônio. Nesses casos, o resultado pode ser uma queda de preços ou aumento da quantidade ofertada, visando a apropriação de parte do excedente do fornecedor com consequência distorção dos mercados. [REF] Fonte: https://sei.cade.gov.br/sei//modulos/pesquisa/md_pesq_documento_consulta_externa.php?11fcbFkN81DNKUdhz4iilnqI5_uKxXOK06JWeBzhMdu1o7VqyXeq9tKSSC3I_YlnBX8Qjt099g7spbtEu5Ayy4ESz_KPZvw8GICHFo3h89GniULsChqNQocAPUA9amHF%22 @pt-br
scope note: [NE03] O exame de poder de mercado na compra é importante usualmente nos casos em que os compradores são os formadores do preço e os fornecedores atuam como tomadores de preços. É o caso de indústrias nas quais o mercado de compra dos produtos é concentrado (com poucas empresas adquirindo toda a produção de insumos) e os fornecedores, normalmente, são menos concentrados e mais numerosos. [REF] CONSELHO ADMINISTRATIVO DE DEFESA ECONÔMICA. Guia para análise de atos de concentração horizontal. Brasília: Cade, 2016. 59 p. @pt-br
scope note: [NE02] Havendo poder de mercado na compra, a primeira questão relevante é identificar se, de fato, os compradores são capazes de exercer poder de monopsônio e em que grau. Avalia-se, primeiramente, se não há outros compradores no mercado geográfico para o qual os ofertantes possam fornecer seus produtos ou serviços de modo suficiente. Caso se verifique que, efetivamente, a empresa compradora detém condições de exercer poder de compra em níveis relevantes, deve-se então avaliar se há reais incentivos para que ela assim o faça e se esses incentivos são incrementados em razão do AC. [REF] CONSELHO ADMINISTRATIVO DE DEFESA ECONÔMICA. Guia para análise de atos de concentração horizontal. Brasília: Cade, 2016. 59 p. @pt-br
dateSubmitted: 19/04/2024 @pt-br
modified: 11/04/2026 00:45:14 @pt-br
broader: Poder de mercado
definition source: [REF] Fonte: Tradução de "Buyer power" https://www.concurrences.com/en/dictionary/buyer-power @pt-br
alternative label: Buyer power
alternative label: Poder de compra @pt-br
alternative label: Poder de mercado do comprador @pt-br
alternative label: Buyer market power
editorial note: 1. Informações coletadas para análise do termos: [DEF1] A habilidade de sustentar preços colusivos em determinada indústria depende também do grau de concentração dos compradores. Um comprador forte pode fazer uso de seu poder de barganha para estimular a competição entre os vendedores, seja ameaçando redirecionar pedidos de um vendedor corrente para outros ou para potenciais entrantes (aqueles com perspectivas de entrada estarão muito interessados em garantir a demanda de um grande comprador) ou ameaçando verticalizar para trás. Ao concentrar seus pedidos, um poderoso comprador pode também administrar a quebra de um conluio. Em vez de manter um fluxo contínuo de pequenos pedidos, pode agrupá-los em maiores e menos frequentes, de modo a induzir ofertantes a se desviarem da estratégia colusiva (SNYDER, 1996). Finalmente, compradores fortes podem projetar leilões de compras de maneira a minimizar riscos de conduta colusiva entre ofertantes. Fonte: MOTTA, Massimo; SALGADO, Lucia Helena. Política de concorrência: teoria e prática e sua aplicação no Brasil. Rio de Janeiro: Elsevier, 2015. {p. 91} [DEF3] O poder do comprador descreve a posição de barganha de um comprador em relação a seu(s) fornecedor(es) de bens ou serviços. Por meio de estratégias de compra, o comprador, unilateralmente ou por meio da coordenação com outros compradores, pode diminuir o preço de compra de seu insumo abaixo do preço de venda padrão do fornecedor, acima ou abaixo do nível competitivo. Há dois subtipos de poder do comprador: primeiro, o poder de monopsônio, que implica um efeito de retenção, sendo ineficiente e apelidado de reverso do poder de monopólio; e segundo, o poder de barganha (ou compensatório), no qual outras táticas além da retenção podem ser usadas em benefício do comprador para reduzir o preço do insumo. O poder de barganha tende a aumentar o bem-estar, pois os lucros supracompetitivos mantidos pelo fornecedor são repassados ao comprador e, por fim, aos consumidores finais se h… @pt-br
memberOf: Microtesauro de Defesa Econômica
definition: Poder de mercado na compra é um tipo de poder de mercado no qual o comprador, por meio de estratégias de compra pode — unilateralmente ou a partir da coordenação com outros compradores — diminuir o preço de compra de seu insumo abaixo do preço de venda padrão do fornecedor, acima ou abaixo do nível competitivo. @pt-br
type: Concept
narrower: Poder de monopsônio
narrower: Poder de oligopsônio
creator: Projeto Cade: Frente de ontologia @pt-br
dateAccepted: 26/04/2024 @pt-br
creation date: 2024-01-19T05:33:00 @pt-br

Poder de mercado
type: Concept
type: NamedIndividual
narrower: Poder de mercado na compra

Poder de monopsônio
type: Concept
type: NamedIndividual
broader: Poder de mercado na compra

Poder de oligopsônio
type: Concept
type: NamedIndividual
broader: Poder de mercado na compra

preferred label
sub property of: label
definition: The preferred lexical label for a resource, in a given language.
comment: skos:prefLabel, skos:altLabel and skos:hiddenLabel are pairwise disjoint properties.
comment: The range of skos:prefLabel is the class of RDF plain literals.
comment: A resource has no more than one value of skos:prefLabel per language tag, and no more than one value of skos:prefLabel without language tag.

alternative label
sub property of: label
definition: An alternative lexical label for a resource.
comment: The range of skos:altLabel is the class of RDF plain literals.
comment: skos:prefLabel, skos:altLabel and skos:hiddenLabel are pairwise disjoint properties.
label: Termo alternativo @pt-br

dateSubmitted
comment: Propriedade de anotação para registro da data de homologação de um termo. @pt-br
label: Data de homologação @pt-br

has broader
sub property of: broaderTransitive
definition: Relates a concept to a concept that is more general in meaning.
comment: Broader concepts are typically rendered as parents in a concept hierarchy (tree).

dateAccepted
comment: Propriedade de anotação a ser utilizada para registro da data de validação de um termo por especialistas de domínio. @pt-br
label: Data de validação @pt-br

has narrower
sub property of: narrowerTransitive
definition: Relates a concept to a concept that is more specific in meaning.
comment: Narrower concepts are typically rendered as children in a concept hierarchy (tree).